2
Vote

Does not build

description

1>------ Rebuild All started: Project: SharpSphinx, Configuration: Debug Any CPU ------
1>C:\dev\sharpsphinx-9090\SharpSphinx\SharpSphinx\SharpSphinx.Util\Cache.cs(29,18,29,23): error CS0542: 'Cache': member names cannot be the same as their enclosing type
1>C:\dev\sharpsphinx-9090\SharpSphinx\SharpSphinx\SharpSphinx.Decoder\AbstractDecoder.cs(18,30,18,44): error CS0246: The type or namespace name 'ResultListener' could not be found (are you missing a using directive or an assembly reference?)
1>C:\dev\sharpsphinx-9090\SharpSphinx\SharpSphinx\SharpSphinx.Decoder\AbstractDecoder.cs(36,25,36,31): error CS0118: 'SharpSphinx.Result' is a 'namespace' but is used like a 'type'
1>C:\dev\sharpsphinx-9090\SharpSphinx\SharpSphinx\SharpSphinx.Decoder\AbstractDecoder.cs(40,135,40,149): error CS0246: The type or namespace name 'ResultListener' could not be found (are you missing a using directive or an assembly reference?)
1>C:\dev\sharpsphinx-9090\SharpSphinx\SharpSphinx\SharpSphinx.Decoder\Search\ISearchManager.cs(50,9,50,15): error CS0118: 'SharpSphinx.Result' is a 'namespace' but is used like a 'type'
1>C:\dev\sharpsphinx-9090\SharpSphinx\SharpSphinx\SharpSphinx.Linguist\Acoustic\IAcousticModel.cs(49,10,49,20): error CS0246: The type or namespace name 'Properties' could not be found (are you missing a using directive or an assembly reference?)
1>C:\dev\sharpsphinx-9090\SharpSphinx\SharpSphinx\SharpSphinx.Linguist\Acoustic\TiedState\Pool.cs(22,25,22,29): error CS0542: 'Pool': member names cannot be the same as their enclosing type
1>C:\dev\sharpsphinx-9090\SharpSphinx\SharpSphinx\SharpSphinx.Result\Edge.cs(43,27,43,35): error CS0246: The type or namespace name 'Lattrice' could not be found (are you missing a using directive or an assembly reference?)
1>C:\dev\sharpsphinx-9090\SharpSphinx\SharpSphinx\SharpSphinx.Util\Configuration\SaxLoader.cs(11,36,11,51): error CS0246: The type or namespace name 'RawPropertyData' could not be found (are you missing a using directive or an assembly reference?)
1>C:\dev\sharpsphinx-9090\SharpSphinx\SharpSphinx\SharpSphinx.Util\Configuration\SaxLoader.cs(24,97,24,112): error CS0246: The type or namespace name 'RawPropertyData' could not be found (are you missing a using directive or an assembly reference?)
1>C:\dev\sharpsphinx-9090\SharpSphinx\SharpSphinx\SharpSphinx.Decoder\AbstractDecoder.cs(18,73,18,87): error CS0246: The type or namespace name 'ResultListener' could not be found (are you missing a using directive or an assembly reference?)
1>C:\dev\sharpsphinx-9090\SharpSphinx\SharpSphinx\SharpSphinx.Decoder\AbstractDecoder.cs(18,64,18,90): error CS0134: 'SharpSphinx.Decoder.AbstractDecoder.resultListeners' is of type 'System.Collections.Generic.List<ResultListener>'. A const field of a reference type other than string can only be initialized with null.
========== Rebuild All: 0 succeeded, 1 failed, 0 skipped ==========

comments